TrueNAS:Cant access the WebUI (Probably problems with the install)

Hey,
I’m running TrueNAS 12.0-U6 and want to install a Minecraft-Server on it.
The WebUI is reachable but I cant login, after I click login the page just reloads.
I installed the MineOS through the Plugins and got a pretty long list in the Install Notes with errors regarding “posix” (I think).
I did research for the whole day and couldn’t find a solution, so I hope that you can help me with this.
Also, I’m pretty new to all of this.

Install Notes

posix@4.2.0 install /usr/local/games/minecraft/node_modules/posix

node-gyp rebuild

posix@4.2.0 install /usr/local/games/minecraft/node_modules/posix

node-gyp rebuild

(node:16084) [DEP0150] DeprecationWarning: Setting process.config is deprecated. In the future the property will be read-only.

(Use node --trace-deprecation ... to show where the warning was created)

gmake: Entering directory ‘/usr/local/games/minecraft/node_modules/posix/build’

(node:16084) [DEP0150] DeprecationWarning: Setting process.config is deprecated. In the future the property will be read-only.

(Use node --trace-deprecation ... to show where the warning was created)

CXX(target) Release/obj.target/posix/src/posix.o

(node:16084) [DEP0150] DeprecationWarning: Setting process.config is deprecated. In the future the property will be read-only.

(Use node --trace-deprecation ... to show where the warning was created)

CXX(target) Release/obj.target/posix/src/posix.o

In file included from …/src/posix.cc:1:

In file included from …/…/nan/nan.h:54:

In file included from /root/.cache/node-gyp/17.0.0/include/node/node.h:63:

In file included from /root/.cache/node-gyp/17.0.0/include/node/v8.h:25:

In file included from /root/.cache/node-gyp/17.0.0/include/node/v8-array-buffer.h:13:

In file included from /root/.cache/node-gyp/17.0.0/include/node/v8-object.h:10:

/root/.cache/node-gyp/17.0.0/include/node/v8-persistent-handle.h:10:10: fatal error: ‘v8-weak-callback-info.h’ file not found

#include “v8-weak-callback-info.h” // NOLINT(build/include_directory)

^~~~~~~~~~~~~~~~~~~~~~~~~

CXX(target) Release/obj.target/posix/src/posix.o

CXX(target) Release/obj.target/posix/src/posix.o

CXX(target) Release/obj.target/posix/src/posix.o

CXX(target) Release/obj.target/posix/src/posix.o

1 error generated.

CXX(target) Release/obj.target/posix/src/posix.o

gmake: *** [posix.target.mk:109: Release/obj.target/posix/src/posix.o] Error 1

gmake: Leaving directory ‘/usr/local/games/minecraft/node_modules/posix/build’

gmake: *** [posix.target.mk:109: Release/obj.target/posix/src/posix.o] Error 1

gmake: Leaving directory ‘/usr/local/games/minecraft/node_modules/posix/build’

gmake: Leaving directory ‘/usr/local/games/minecraft/node_modules/posix/build’

gmake: Leaving directory ‘/usr/local/games/minecraft/node_modules/posix/build’

gmake: Leaving directory ‘/usr/local/games/minecraft/node_modules/posix/build’

gmake: Leaving directory ‘/usr/local/games/minecraft/node_modules/posix/build’

gmake: Leaving directory ‘/usr/local/games/minecraft/node_modules/posix/build’

gyp ERR! build error

gmake: Leaving directory ‘/usr/local/games/minecraft/node_modules/posix/build’

gmake: Leaving directory ‘/usr/local/games/minecraft/node_modules/posix/build’

gmake: Leaving directory ‘/usr/local/games/minecraft/node_modules/posix/build’

gmake: Leaving directory ‘/usr/local/games/minecraft/node_modules/posix/build’

gmake: Leaving directory ‘/usr/local/games/minecraft/node_modules/posix/build’

gmake: Leaving directory ‘/usr/local/games/minecraft/node_modules/posix/build’

gyp ERR! stack Error: gmake failed with exit code: 2

gmake: Leaving directory ‘/usr/local/games/minecraft/node_modules/posix/build’

gmake: Leaving directory ‘/usr/local/games/minecraft/node_modules/posix/build’

gmake: Leaving directory ‘/usr/local/games/minecraft/node_modules/posix/build’

gmake: Leaving directory ‘/usr/local/games/minecraft/node_modules/posix/build’

gmake: Leaving directory ‘/usr/local/games/minecraft/node_modules/posix/build’

gmake: Leaving directory ‘/usr/local/games/minecraft/node_modules/posix/build’

gyp ERR! stack at ChildProcess.onExit (/usr/local/lib/node_modules/npm/node_modules/node-gyp/lib/build.js:194:23)

gmake: Leaving directory ‘/usr/local/games/minecraft/node_modules/posix/build’

gmake: Leaving directory ‘/usr/local/games/minecraft/node_modules/posix/build’

gmake: Leaving directory ‘/usr/local/games/minecraft/node_modules/posix/build’

gmake: Leaving directory ‘/usr/local/games/minecraft/node_modules/posix/build’

gmake: Leaving directory ‘/usr/local/games/minecraft/node_modules/posix/build’

gmake: Leaving directory ‘/usr/local/games/minecraft/node_modules/posix/build’

gyp ERR! stack at ChildProcess.emit (node:events:390:28)

gmake: Leaving directory ‘/usr/local/games/minecraft/node_modules/posix/build’

gmake: Leaving directory ‘/usr/local/games/minecraft/node_modules/posix/build’

gmake: Leaving directory ‘/usr/local/games/minecraft/node_modules/posix/build’

gmake: Leaving directory ‘/usr/local/games/minecraft/node_modules/posix/build’

gmake: Leaving directory ‘/usr/local/games/minecraft/node_modules/posix/build’

gmake: Leaving directory ‘/usr/local/games/minecraft/node_modules/posix/build’

gyp ERR! stack at Process.ChildProcess._handle.onexit (node:internal/child_process:290:12)

gmake: Leaving directory ‘/usr/local/games/minecraft/node_modules/posix/build’

gmake: Leaving directory ‘/usr/local/games/minecraft/node_modules/posix/build’

gmake: Leaving directory ‘/usr/local/games/minecraft/node_modules/posix/build’

gmake: Leaving directory ‘/usr/local/games/minecraft/node_modules/posix/build’

gmake: Leaving directory ‘/usr/local/games/minecraft/node_modules/posix/build’

gmake: Leaving directory ‘/usr/local/games/minecraft/node_modules/posix/build’

gyp ERR! System FreeBSD 12.2-RELEASE-p10

gmake: Leaving directory ‘/usr/local/games/minecraft/node_modules/posix/build’

gmake: Leaving directory ‘/usr/local/games/minecraft/node_modules/posix/build’

gmake: Leaving directory ‘/usr/local/games/minecraft/node_modules/posix/build’

gmake: Leaving directory ‘/usr/local/games/minecraft/node_modules/posix/build’

gmake: Leaving directory ‘/usr/local/games/minecraft/node_modules/posix/build’

gmake: Leaving directory ‘/usr/local/games/minecraft/node_modules/posix/build’

gyp ERR! command “/usr/local/bin/node” “/usr/local/lib/node_modules/npm/node_modules/node-gyp/bin/node-gyp.js” “rebuild”

gmake: Leaving directory ‘/usr/local/games/minecraft/node_modules/posix/build’

gmake: Leaving directory ‘/usr/local/games/minecraft/node_modules/posix/build’

gmake: Leaving directory ‘/usr/local/games/minecraft/node_modules/posix/build’

gmake: Leaving directory ‘/usr/local/games/minecraft/node_modules/posix/build’

gmake: Leaving directory ‘/usr/local/games/minecraft/node_modules/posix/build’

gmake: Leaving directory ‘/usr/local/games/minecraft/node_modules/posix/build’

gyp ERR! cwd /usr/local/games/minecraft/node_modules/posix

gmake: Leaving directory ‘/usr/local/games/minecraft/node_modules/posix/build’

gmake: Leaving directory ‘/usr/local/games/minecraft/node_modules/posix/build’

gmake: Leaving directory ‘/usr/local/games/minecraft/node_modules/posix/build’

gmake: Leaving directory ‘/usr/local/games/minecraft/node_modules/posix/build’

gmake: Leaving directory ‘/usr/local/games/minecraft/node_modules/posix/build’

gmake: Leaving directory ‘/usr/local/games/minecraft/node_modules/posix/build’

gyp ERR! node -v v17.0.0

gmake: Leaving directory ‘/usr/local/games/minecraft/node_modules/posix/build’

gmake: Leaving directory ‘/usr/local/games/minecraft/node_modules/posix/build’

gmake: Leaving directory ‘/usr/local/games/minecraft/node_modules/posix/build’

gmake: Leaving directory ‘/usr/local/games/minecraft/node_modules/posix/build’

gmake: Leaving directory ‘/usr/local/games/minecraft/node_modules/posix/build’

gmake: Leaving directory ‘/usr/local/games/minecraft/node_modules/posix/build’

gyp ERR! node-gyp -v v5.1.0

gmake: Leaving directory ‘/usr/local/games/minecraft/node_modules/posix/build’

gmake: Leaving directory ‘/usr/local/games/minecraft/node_modules/posix/build’

gmake: Leaving directory ‘/usr/local/games/minecraft/node_modules/posix/build’

gmake: Leaving directory ‘/usr/local/games/minecraft/node_modules/posix/build’

gmake: Leaving directory ‘/usr/local/games/minecraft/node_modules/posix/build’

gmake: Leaving directory ‘/usr/local/games/minecraft/node_modules/posix/build’

gyp ERR! not ok

gmake: Leaving directory ‘/usr/local/games/minecraft/node_modules/posix/build’

npm ERR! code ELIFECYCLE

gmake: Leaving directory ‘/usr/local/games/minecraft/node_modules/posix/build’

npm ERR! errno 1

gmake: Leaving directory ‘/usr/local/games/minecraft/node_modules/posix/build’

npm ERR! posix@4.2.0 install: node-gyp rebuild

npm ERR! Exit status 1

gmake: Leaving directory ‘/usr/local/games/minecraft/node_modules/posix/build’

npm ERR!

npm ERR! Failed at the posix@4.2.0 install script.

npm ERR! This is probably not a problem with npm. There is likely additional logging output above.

gmake: Leaving directory ‘/usr/local/games/minecraft/node_modules/posix/build’

gmake: Leaving directory ‘/usr/local/games/minecraft/node_modules/posix/build’

npm ERR! A complete log of this run can be found in:

npm ERR! /root/.npm/_logs/2021-10-29T17_16_15_597Z-debug.log

posix@4.2.0 install /usr/local/games/minecraft/node_modules/posix

node-gyp rebuild

npm ERR! A complete log of this run can be found in:

npm ERR! /root/.npm/_logs/2021-10-29T17_16_15_597Z-debug.log

posix@4.2.0 install /usr/local/games/minecraft/node_modules/posix

node-gyp rebuild

(node:16098) [DEP0150] DeprecationWarning: Setting process.config is deprecated. In the future the property will be read-only.

(Use node --trace-deprecation ... to show where the warning was created)

gmake: Entering directory ‘/usr/local/games/minecraft/node_modules/posix/build’

(node:16098) [DEP0150] DeprecationWarning: Setting process.config is deprecated. In the future the property will be read-only.

(Use node --trace-deprecation ... to show where the warning was created)

CXX(target) Release/obj.target/posix/src/posix.o

(node:16098) [DEP0150] DeprecationWarning: Setting process.config is deprecated. In the future the property will be read-only.

(Use node --trace-deprecation ... to show where the warning was created)

CXX(target) Release/obj.target/posix/src/posix.o

In file included from …/src/posix.cc:1:

In file included from …/…/nan/nan.h:54:

In file included from /root/.cache/node-gyp/17.0.0/include/node/node.h:63:

In file included from /root/.cache/node-gyp/17.0.0/include/node/v8.h:25:

In file included from /root/.cache/node-gyp/17.0.0/include/node/v8-array-buffer.h:13:

In file included from /root/.cache/node-gyp/17.0.0/include/node/v8-object.h:10:

/root/.cache/node-gyp/17.0.0/include/node/v8-persistent-handle.h:10:10: fatal error: ‘v8-weak-callback-info.h’ file not found

#include “v8-weak-callback-info.h” // NOLINT(build/include_directory)

^~~~~~~~~~~~~~~~~~~~~~~~~

CXX(target) Release/obj.target/posix/src/posix.o

1 error generated.

gmake: Leaving directory ‘/usr/local/games/minecraft/node_modules/posix/build’

gmake: *** [posix.target.mk:109: Release/obj.target/posix/src/posix.o] Error 1

gmake: Leaving directory ‘/usr/local/games/minecraft/node_modules/posix/build’

gmake: Leaving directory ‘/usr/local/games/minecraft/node_modules/posix/build’

gyp ERR! build error

gmake: Leaving directory ‘/usr/local/games/minecraft/node_modules/posix/build’

gmake: Leaving directory ‘/usr/local/games/minecraft/node_modules/posix/build’

gmake: Leaving directory ‘/usr/local/games/minecraft/node_modules/posix/build’

gmake: Leaving directory ‘/usr/local/games/minecraft/node_modules/posix/build’

gyp ERR! stack Error: gmake failed with exit code: 2

gyp ERR! stack at ChildProcess.onExit (/usr/local/lib/node_modules/npm/node_modules/node-gyp/lib/build.js:194:23)

gyp ERR! stack at ChildProcess.emit (node:events:390:28)

gyp ERR! stack at Process.ChildProcess._handle.onexit (node:internal/child_process:290:12)

gmake: Leaving directory ‘/usr/local/games/minecraft/node_modules/posix/build’

gyp ERR! System FreeBSD 12.2-RELEASE-p10

gyp ERR! command “/usr/local/bin/node” “/usr/local/lib/node_modules/npm/node_modules/node-gyp/bin/node-gyp.js” “rebuild”

gyp ERR! cwd /usr/local/games/minecraft/node_modules/posix

gyp ERR! node -v v17.0.0

gmake: Leaving directory ‘/usr/local/games/minecraft/node_modules/posix/build’

gyp ERR! node-gyp -v v5.1.0

gyp ERR! not ok

gmake: Leaving directory ‘/usr/local/games/minecraft/node_modules/posix/build’

gmake: Leaving directory ‘/usr/local/games/minecraft/node_modules/posix/build’

npm ERR! code ELIFECYCLE

npm ERR! errno 1

gmake: Leaving directory ‘/usr/local/games/minecraft/node_modules/posix/build’

npm ERR! posix@4.2.0 install: node-gyp rebuild

npm ERR! Exit status 1

gmake: Leaving directory ‘/usr/local/games/minecraft/node_modules/posix/build’

npm ERR!

npm ERR! Failed at the posix@4.2.0 install script.

npm ERR! This is probably not a problem with npm. There is likely additional logging output above.

gmake: Leaving directory ‘/usr/local/games/minecraft/node_modules/posix/build’

gmake: Leaving directory ‘/usr/local/games/minecraft/node_modules/posix/build’

npm ERR! A complete log of this run can be found in:

npm ERR! /root/.npm/_logs/2021-10-29T17_16_20_369Z-debug.log

mineos_enable: → YES

ERR! /root/.npm/_logs/2021-10-29T17_16_20_369Z-debug.log

Starting mineos.

ERR! /root/.npm/_logs/2021-10-29T17_16_20_369Z-debug.log

Starting mineos daemon…

ERR! /root/.npm/_logs/2021-10-29T17_16_20_369Z-debug.log

mineos daemon started. PID: 16145

ERR! /root/.npm/_logs/2021-10-29T17_16_20_369Z-debug.log

ERR! /root/.npm/_logs/2021-10-29T17_16_20_369Z-debug.log

did you manage to fix this problem? I am having similar issues, the webUI will not resolve, but the modules seem to be working

No, I tried everything prior to posting here but could not get it working. I set up a linux server on my hardware for now.